Program type already present: com.google.common.util.concurrent.ListenableFuture Duplicate Class

问题: I can't build my project, with every new dependency that I try to add I get a fist full of new errors. I tried migrating my project using the IDE to androidx libraries, but...

问题:

I can't build my project, with every new dependency that I try to add I get a fist full of new errors. I tried migrating my project using the IDE to androidx libraries, but that didn't solve anything.

Right now I have these libraries:

dependencies {
    implementation fileTree(dir: 'libs', include: ['*.jar'])
    compile('com.google.apis:google-api-services-youtube:v3-rev206-1.25.0') {
        exclude group: 'org.apache.httpcomponents'
    }
    compile 'androidx.appcompat:appcompat:1.0.2'
    compile 'androidx.constraintlayout:constraintlayout:2.0.0-alpha3'
    compile 'com.googlecode.mp4parser:isoparser:1.1.22'
    compile 'androidx.annotation:annotation:1.1.0-alpha01'
    implementation('com.github.evgenyneu:js-evaluator-for-android:v4.0.0') {
        exclude module: 'appcompat-v7'
    }
    compile 'com.google.android.exoplayer:exoplayer:2.7.3'
    compile 'com.google.android.material:material:1.1.0-alpha03'

}

And I get this error: Error: Program type already present: com.google.common.util.concurrent.ListenableFuture

Have no idea how to properly set everything up, it's driving me crazy.

Edit Logs:

java.lang.RuntimeException: com.android.builder.dexing.DexArchiveMergerException: Error while merging dex archives: C:UsersLiudasAndroidStudioProjectsBakalaurinis40appbuildintermediatestransformsdexBuilderdebug.jar, C:UsersLiudasAndroidStudioProjectsBakalaurinis40appbuildintermediatestransformsdexBuilderdebug1.jar, C:UsersLiudasAndroidStudioProjectsBakalaurinis40appbuildintermediatestransformsdexBuilderdebug2.jar, C:UsersLiudasAndroidStudioProjectsBakalaurinis40appbuildintermediatestransformsdexBuilderdebug3.jar, C:UsersLiudasAndroidStudioProjectsBakalaurinis40appbuildintermediatestransformsdexBuilderdebug4.jar, C:UsersLiudasAndroidStudioProjectsBakalaurinis40appbuildintermediatestransformsdexBuilderdebug5.jar, C:UsersLiudasAndroidStudioProjectsBakalaurinis40appbuildintermediatestransformsdexBuilderdebug6.jar, C:UsersLiudasAndroidStudioProjectsBakalaurinis40appbuildintermediatestransformsdexBuilderdebug7.jar, C:UsersLiudasAndroidStudioProjectsBakalaurinis40appbuildintermediatestransformsdexBuilderdebug8.jar, C:UsersLiudasAndroidStudioProjectsBakalaurinis40appbuildintermediatestransformsdexBuilderdebug9.jar, C:UsersLiudasAndroidStudioProjectsBakalaurinis40appbuildintermediatestransformsdexBuilderdebug10.jar, C:UsersLiudasAndroidStudioProjectsBakalaurinis40appbuildintermediatestransformsdexBuilderdebug11.jar, C:UsersLiudasAndroidStudioProjectsBakalaurinis40appbuildintermediatestransformsdexBuilderdebug12.jar, C:UsersLiudasAndroidStudioProjectsBakalaurinis40appbuildintermediatestransformsdexBuilderdebug13.jar, C:UsersLiudasAndroidStudioProjectsBakalaurinis40appbuildintermediatestransformsdexBuilderdebug14.jar, C:UsersLiudasAndroidStudioProjectsBakalaurinis40appbuildintermediatestransformsdexBuilderdebug15.jar, C:UsersLiudasAndroidStudioProjectsBakalaurinis40appbuildintermediatestransformsdexBuilderdebug16.jar, C:UsersLiudasAndroidStudioProjectsBakalaurinis40appbuildintermediatestransformsdexBuilderdebug17.jar, C:UsersLiudasAndroidStudioProjectsBakalaurinis40appbuildintermediatestransformsdexBuilderdebug18.jar, C:UsersLiudasAndroidStudioProjectsBakalaurinis40appbuildintermediatestransformsdexBuilderdebug19.jar, C:UsersLiudasAndroidStudioProjectsBakalaurinis40appbuildintermediatestransformsdexBuilderdebug20.jar, C:UsersLiudasAndroidStudioProjectsBakalaurinis40appbuildintermediatestransformsdexBuilderdebug21.jar, C:UsersLiudasAndroidStudioProjectsBakalaurinis40appbuildintermediatestransformsdexBuilderdebug22.jar, C:UsersLiudasAndroidStudioProjectsBakalaurinis40appbuildintermediatestransformsdexBuilderdebug23.jar, C:UsersLiudasAndroidStudioProjectsBakalaurinis40appbuildintermediatestransformsdexBuilderdebug24.jar, C:UsersLiudasAndroidStudioProjectsBakalaurinis40appbuildintermediatestransformsdexBuilderdebug25.jar, C:UsersLiudasAndroidStudioProjectsBakalaurinis40appbuildintermediatestransformsdexBuilderdebug26.jar, C:UsersLiudasAndroidStudioProjectsBakalaurinis40appbuildintermediatestransformsdexBuilderdebug27.jar, C:UsersLiudasAndroidStudioProjectsBakalaurinis40appbuildintermediatestransformsdexBuilderdebug28.jar, C:UsersLiudasAndroidStudioProjectsBakalaurinis40appbuildintermediatestransformsdexBuilderdebug29.jar, C:UsersLiudasAndroidStudioProjectsBakalaurinis40appbuildintermediatestransformsdexBuilderdebug30.jar, C:UsersLiudasAndroidStudioProjectsBakalaurinis40appbuildintermediatestransformsdexBuilderdebug31.jar, C:UsersLiudasAndroidStudioProjectsBakalaurinis40appbuildintermediatestransformsdexBuilderdebug32.jar, C:UsersLiudasAndroidStudioProjectsBakalaurinis40appbuildintermediatestransformsdexBuilderdebug33.jar, C:UsersLiudasAndroidStudioProjectsBakalaurinis40appbuildintermediatestransformsdexBuilderdebug34.jar, C:UsersLiudasAndroidStudioProjectsBakalaurinis40appbuildintermediatestransformsdexBuilderdebug35.jar, C:UsersLiudasAndroidStudioProjectsBakalaurinis40appbuildintermediatestransformsdexBuilderdebug36.jar, C:UsersLiudasAndroidStudioProjectsBakalaurinis40appbuildintermediatestransformsdexBuilderdebug37.jar, C:UsersLiudasAndroidStudioProjectsBakalaurinis40appbuildintermediatestransformsdexBuilderdebug38.jar, C:UsersLiudasAndroidStudioProjectsBakalaurinis40appbuildintermediatestransformsdexBuilderdebug39.jar, C:UsersLiudasAndroidStudioProjectsBakalaurinis40appbuildintermediatestransformsdexBuilderdebug40.jar, C:UsersLiudasAndroidStudioProjectsBakalaurinis40appbuildintermediatestransformsdexBuilderdebug41.jar, C:UsersLiudasAndroidStudioProjectsBakalaurinis40appbuildintermediatestransformsdexBuilderdebug42.jar, C:UsersLiudasAndroidStudioProjectsBakalaurinis40appbuildintermediatestransformsdexBuilderdebug43.jar, C:UsersLiudasAndroidStudioProjectsBakalaurinis40appbuildintermediatestransformsdexBuilderdebug44.jar, C:UsersLiudasAndroidStudioProjectsBakalaurinis40appbuildintermediatestransformsdexBuilderdebug45.jar, C:UsersLiudasAndroidStudioProjectsBakalaurinis40appbuildintermediatestransformsdexBuilderdebug46.jar, C:UsersLiudasAndroidStudioProjectsBakalaurinis40appbuildintermediatestransformsdexBuilderdebug47.jar, C:UsersLiudasAndroidStudioProjectsBakalaurinis40appbuildintermediatestransformsdexBuilderdebug48.jar, C:UsersLiudasAndroidStudioProjectsBakalaurinis40appbuildintermediatestransformsdexBuilderdebug49.jar, C:UsersLiudasAndroidStudioProjectsBakalaurinis40appbuildintermediatestransformsdexBuilderdebug50.jar, C:UsersLiudasAndroidStudioProjectsBakalaurinis40appbuildintermediatestransformsdexBuilderdebug51.jar, C:UsersLiudasAndroidStudioProjectsBakalaurinis40appbuildintermediatestransformsdexBuilderdebug52.jar, C:UsersLiudasAndroidStudioProjectsBakalaurinis40appbuildintermediatestransformsdexBuilderdebug53.jar, C:UsersLiudasAndroidStudioProjectsBakalaurinis40appbuildintermediatestransformsdexBuilderdebug54.jar, C:UsersLiudasAndroidStudioProjectsBakalaurinis40appbuildintermediatestransformsdexBuilderdebug55.jar, C:UsersLiudasAndroidStudioProjectsBakalaurinis40appbuildintermediatestransformsdexBuilderdebug56.jar, C:UsersLiudasAndroidStudioProjectsBakalaurinis40appbuildintermediatestransformsdexBuilderdebug57.jar, C:UsersLiudasAndroidStudioProjectsBakalaurinis40appbuildintermediatestransformsdexBuilderdebug58.jar, C:UsersLiudasAndroidStudioProjectsBakalaurinis40appbuildintermediatestransformsdexBuilderdebug59.jar, C:UsersLiudasAndroidStudioProjectsBakalaurinis40appbuildintermediatestransformsdexBuilderdebug60.jar, C:UsersLiudasAndroidStudioProjectsBakalaurinis40appbuildintermediatestransformsdexBuilderdebug61.jar, C:UsersLiudasAndroidStudioProjectsBakalaurinis40appbuildintermediatestransformsdexBuilderdebug62.jar, C:UsersLiudasAndroidStudioProjectsBakalaurinis40appbuildintermediatestransformsdexBuilderdebug63.jar, C:UsersLiudasAndroidStudioProjectsBakalaurinis40appbuildintermediatestransformsdexBuilderdebug64.jar, C:UsersLiudasAndroidStudioProjectsBakalaurinis40appbuildintermediatestransformsdexBuilderdebug65.jar, C:UsersLiudasAndroidStudioProjectsBakalaurinis40appbuildintermediatestransformsdexBuilderdebug66.jar, C:UsersLiudasAndroidStudioProjectsBakalaurinis40appbuildintermediatestransformsdexBuilderdebug67.jar, C:UsersLiudasAndroidStudioProjectsBakalaurinis40appbuildintermediatestransformsdexBuilderdebug68.jar, C:UsersLiudasAndroidStudioProjectsBakalaurinis40appbuildintermediatestransformsdexBuilderdebug70.jar
Program type already present: com.google.common.util.concurrent.ListenableFuture
Learn how to resolve the issue at https://developer.android.com/studio/build/dependencies#duplicate_classes.
    at com.android.builder.profile.Recorder$Block.handleException(Recorder.java:55)
    at com.android.builder.profile.ThreadRecorder.record(ThreadRecorder.java:104)
    at com.android.build.gradle.internal.pipeline.TransformTask.transform(TransformTask.java:230)
    at sun.reflect.NativeMethodAccessorImpl.invoke0(Native Method)
    at sun.reflect.NativeMethodAccessorImpl.invoke(NativeMethodAccessorImpl.java:62)
    at sun.reflect.DelegatingMethodAccessorImpl.invoke(DelegatingMethodAccessorImpl.java:43)
    at java.lang.reflect.Method.invoke(Method.java:498)
    at org.gradle.internal.reflect.JavaMethod.invoke(JavaMethod.java:73)
    at org.gradle.api.internal.project.taskfactory.IncrementalTaskAction.doExecute(IncrementalTaskAction.java:50)
    at org.gradle.api.internal.project.taskfactory.StandardTaskAction.execute(StandardTaskAction.java:39)
    at org.gradle.api.internal.project.taskfactory.StandardTaskAction.execute(StandardTaskAction.java:26)
    at org.gradle.api.internal.tasks.execution.ExecuteActionsTaskExecuter$1.run(ExecuteActionsTaskExecuter.java:124)
    at org.gradle.internal.progress.DefaultBuildOperationExecutor$RunnableBuildOperationWorker.execute(DefaultBuildOperationExecutor.java:336)
    at org.gradle.internal.progress.DefaultBuildOperationExecutor$RunnableBuildOperationWorker.execute(DefaultBuildOperationExecutor.java:328)
    at org.gradle.internal.progress.DefaultBuildOperationExecutor.execute(DefaultBuildOperationExecutor.java:199)
    at org.gradle.internal.progress.DefaultBuildOperationExecutor.run(DefaultBuildOperationExecutor.java:110)
    at org.gradle.api.internal.tasks.execution.ExecuteActionsTaskExecuter.executeAction(ExecuteActionsTaskExecuter.java:113)
    at org.gradle.api.internal.tasks.execution.ExecuteActionsTaskExecuter.executeActions(ExecuteActionsTaskExecuter.java:95)
    at org.gradle.api.internal.tasks.execution.ExecuteActionsTaskExecuter.execute(ExecuteActionsTaskExecuter.java:73)
    at org.gradle.api.internal.tasks.execution.OutputDirectoryCreatingTaskExecuter.execute(OutputDirectoryCreatingTaskExecuter.java:51)
    at org.gradle.api.internal.tasks.execution.SkipUpToDateTaskExecuter.execute(SkipUpToDateTaskExecuter.java:59)
    at org.gradle.api.internal.tasks.execution.ResolveTaskOutputCachingStateExecuter.execute(ResolveTaskOutputCachingStateExecuter.java:54)
    at org.gradle.api.internal.tasks.execution.ValidatingTaskExecuter.execute(ValidatingTaskExecuter.java:59)
    at org.gradle.api.internal.tasks.execution.SkipEmptySourceFilesTaskExecuter.execute(SkipEmptySourceFilesTaskExecuter.java:101)
    at org.gradle.api.internal.tasks.execution.FinalizeInputFilePropertiesTaskExecuter.execute(FinalizeInputFilePropertiesTaskExecuter.java:44)
    at org.gradle.api.internal.tasks.execution.CleanupStaleOutputsExecuter.execute(CleanupStaleOutputsExecuter.java:91)
    at org.gradle.api.internal.tasks.execution.ResolveTaskArtifactStateTaskExecuter.execute(ResolveTaskArtifactStateTaskExecuter.java:62)
    at org.gradle.api.internal.tasks.execution.SkipTaskWithNoActionsExecuter.execute(SkipTaskWithNoActionsExecuter.java:59)
    at org.gradle.api.internal.tasks.execution.SkipOnlyIfTaskExecuter.execute(SkipOnlyIfTaskExecuter.java:54)
    at org.gradle.api.internal.tasks.execution.ExecuteAtMostOnceTaskExecuter.execute(ExecuteAtMostOnceTaskExecuter.java:43)
    at org.gradle.api.internal.tasks.execution.CatchExceptionTaskExecuter.execute(CatchExceptionTaskExecuter.java:34)
    at org.gradle.execution.taskgraph.DefaultTaskGraphExecuter$EventFiringTaskWorker$1.run(DefaultTaskGraphExecuter.java:256)
    at org.gradle.internal.progress.DefaultBuildOperationExecutor$RunnableBuildOperationWorker.execute(DefaultBuildOperationExecutor.java:336)
    at org.gradle.internal.progress.DefaultBuildOperationExecutor$RunnableBuildOperationWorker.execute(DefaultBuildOperationExecutor.java:328)
    at org.gradle.internal.progress.DefaultBuildOperationExecutor.execute(DefaultBuildOperationExecutor.java:199)
    at org.gradle.internal.progress.DefaultBuildOperationExecutor.run(DefaultBuildOperationExecutor.java:110)
    at org.gradle.execution.taskgraph.DefaultTaskGraphExecuter$EventFiringTaskWorker.execute(DefaultTaskGraphExecuter.java:249)
    at org.gradle.execution.taskgraph.DefaultTaskGraphExecuter$EventFiringTaskWorker.execute(DefaultTaskGraphExecuter.java:238)
    at org.gradle.execution.taskgraph.DefaultTaskPlanExecutor$TaskExecutorWorker.processTask(DefaultTaskPlanExecutor.java:123)
    at org.gradle.execution.taskgraph.DefaultTaskPlanExecutor$TaskExecutorWorker.access$200(DefaultTaskPlanExecutor.java:79)
    at org.gradle.execution.taskgraph.DefaultTaskPlanExecutor$TaskExecutorWorker$1.execute(DefaultTaskPlanExecutor.java:104)
    at org.gradle.execution.taskgraph.DefaultTaskPlanExecutor$TaskExecutorWorker$1.execute(DefaultTaskPlanExecutor.java:98)
    at org.gradle.execution.taskgraph.DefaultTaskExecutionPlan.execute(DefaultTaskExecutionPlan.java:663)
    at org.gradle.execution.taskgraph.DefaultTaskExecutionPlan.executeWithTask(DefaultTaskExecutionPlan.java:597)
    at org.gradle.execution.taskgraph.DefaultTaskPlanExecutor$TaskExecutorWorker.run(DefaultTaskPlanExecutor.java:98)
    at org.gradle.internal.concurrent.ExecutorPolicy$CatchAndRecordFailures.onExecute(ExecutorPolicy.java:63)
    at org.gradle.internal.concurrent.ManagedExecutorImpl$1.run(ManagedExecutorImpl.java:46)
    at java.util.concurrent.ThreadPoolExecutor.runWorker(ThreadPoolExecutor.java:1142)
    at java.util.concurrent.ThreadPoolExecutor$Worker.run(ThreadPoolExecutor.java:617)
    at org.gradle.internal.concurrent.ThreadFactoryImpl$ManagedThreadRunnable.run(ThreadFactoryImpl.java:55)
    at java.lang.Thread.run(Thread.java:745)
Caused by: com.android.builder.dexing.DexArchiveMergerException: Error while merging dex archives: C:UsersLiudasAndroidStudioProjectsBakalaurinis40appbuildintermediatestransformsdexBuilderdebug.jar, C:UsersLiudasAndroidStudioProjectsBakalaurinis40appbuildintermediatestransformsdexBuilderdebug1.jar, C:UsersLiudasAndroidStudioProjectsBakalaurinis40appbuildintermediatestransformsdexBuilderdebug2.jar, C:UsersLiudasAndroidStudioProjectsBakalaurinis40appbuildintermediatestransformsdexBuilderdebug3.jar, C:UsersLiudasAndroidStudioProjectsBakalaurinis40appbuildintermediatestransformsdexBuilderdebug4.jar, C:UsersLiudasAndroidStudioProjectsBakalaurinis40appbuildintermediatestransformsdexBuilderdebug5.jar, C:UsersLiudasAndroidStudioProjectsBakalaurinis40appbuildintermediatestransformsdexBuilderdebug6.jar, C:UsersLiudasAndroidStudioProjectsBakalaurinis40appbuildintermediatestransformsdexBuilderdebug7.jar, C:UsersLiudasAndroidStudioProjectsBakalaurinis40appbuildintermediatestransformsdexBuilderdebug8.jar, C:UsersLiudasAndroidStudioProjectsBakalaurinis40appbuildintermediatestransformsdexBuilderdebug9.jar, C:UsersLiudasAndroidStudioProjectsBakalaurinis40appbuildintermediatestransformsdexBuilderdebug10.jar, C:UsersLiudasAndroidStudioProjectsBakalaurinis40appbuildintermediatestransformsdexBuilderdebug11.jar, C:UsersLiudasAndroidStudioProjectsBakalaurinis40appbuildintermediatestransformsdexBuilderdebug12.jar, C:UsersLiudasAndroidStudioProjectsBakalaurinis40appbuildintermediatestransformsdexBuilderdebug13.jar, C:UsersLiudasAndroidStudioProjectsBakalaurinis40appbuildintermediatestransformsdexBuilderdebug14.jar, C:UsersLiudasAndroidStudioProjectsBakalaurinis40appbuildintermediatestransformsdexBuilderdebug15.jar, C:UsersLiudasAndroidStudioProjectsBakalaurinis40appbuildintermediatestransformsdexBuilderdebug16.jar, C:UsersLiudasAndroidStudioProjectsBakalaurinis40appbuildintermediatestransformsdexBuilderdebug17.jar, C:UsersLiudasAndroidStudioProjectsBakalaurinis40appbuildintermediatestransformsdexBuilderdebug18.jar, C:UsersLiudasAndroidStudioProjectsBakalaurinis40appbuildintermediatestransformsdexBuilderdebug19.jar, C:UsersLiudasAndroidStudioProjectsBakalaurinis40appbuildintermediatestransformsdexBuilderdebug20.jar, C:UsersLiudasAndroidStudioProjectsBakalaurinis40appbuildintermediatestransformsdexBuilderdebug21.jar, C:UsersLiudasAndroidStudioProjectsBakalaurinis40appbuildintermediatestransformsdexBuilderdebug22.jar, C:UsersLiudasAndroidStudioProjectsBakalaurinis40appbuildintermediatestransformsdexBuilderdebug23.jar, C:UsersLiudasAndroidStudioProjectsBakalaurinis40appbuildintermediatestransformsdexBuilderdebug24.jar, C:UsersLiudasAndroidStudioProjectsBakalaurinis40appbuildintermediatestransformsdexBuilderdebug25.jar, C:UsersLiudasAndroidStudioProjectsBakalaurinis40appbuildintermediatestransformsdexBuilderdebug26.jar, C:UsersLiudasAndroidStudioProjectsBakalaurinis40appbuildintermediatestransformsdexBuilderdebug27.jar, C:UsersLiudasAndroidStudioProjectsBakalaurinis40appbuildintermediatestransformsdexBuilderdebug28.jar, C:UsersLiudasAndroidStudioProjectsBakalaurinis40appbuildintermediatestransformsdexBuilderdebug29.jar, C:UsersLiudasAndroidStudioProjectsBakalaurinis40appbuildintermediatestransformsdexBuilderdebug30.jar, C:UsersLiudasAndroidStudioProjectsBakalaurinis40appbuildintermediatestransformsdexBuilderdebug31.jar, C:UsersLiudasAndroidStudioProjectsBakalaurinis40appbuildintermediatestransformsdexBuilderdebug32.jar, C:UsersLiudasAndroidStudioProjectsBakalaurinis40appbuildintermediatestransformsdexBuilderdebug33.jar, C:UsersLiudasAndroidStudioProjectsBakalaurinis40appbuildintermediatestransformsdexBuilderdebug34.jar, C:UsersLiudasAndroidStudioProjectsBakalaurinis40appbuildintermediatestransformsdexBuilderdebug35.jar, C:UsersLiudasAndroidStudioProjectsBakalaurinis40appbuildintermediatestransformsdexBuilderdebug36.jar, C:UsersLiudasAndroidStudioProjectsBakalaurinis40appbuildintermediatestransformsdexBuilderdebug37.jar, C:UsersLiudasAndroidStudioProjectsBakalaurinis40appbuildintermediatestransformsdexBuilderdebug38.jar, C:UsersLiudasAndroidStudioProjectsBakalaurinis40appbuildintermediatestransformsdexBuilderdebug39.jar, C:UsersLiudasAndroidStudioProjectsBakalaurinis40appbuildintermediatestransformsdexBuilderdebug40.jar, C:UsersLiudasAndroidStudioProjectsBakalaurinis40appbuildintermediatestransformsdexBuilderdebug41.jar, C:UsersLiudasAndroidStudioProjectsBakalaurinis40appbuildintermediatestransformsdexBuilderdebug42.jar, C:UsersLiudasAndroidStudioProjectsBakalaurinis40appbuildintermediatestransformsdexBuilderdebug43.jar, C:UsersLiudasAndroidStudioProjectsBakalaurinis40appbuildintermediatestransformsdexBuilderdebug44.jar, C:UsersLiudasAndroidStudioProjectsBakalaurinis40appbuildintermediatestransformsdexBuilderdebug45.jar, C:UsersLiudasAndroidStudioProjectsBakalaurinis40appbuildintermediatestransformsdexBuilderdebug46.jar, C:UsersLiudasAndroidStudioProjectsBakalaurinis40appbuildintermediatestransformsdexBuilderdebug47.jar, C:UsersLiudasAndroidStudioProjectsBakalaurinis40appbuildintermediatestransformsdexBuilderdebug48.jar, C:UsersLiudasAndroidStudioProjectsBakalaurinis40appbuildintermediatestransformsdexBuilderdebug49.jar, C:UsersLiudasAndroidStudioProjectsBakalaurinis40appbuildintermediatestransformsdexBuilderdebug50.jar, C:UsersLiudasAndroidStudioProjectsBakalaurinis40appbuildintermediatestransformsdexBuilderdebug51.jar, C:UsersLiudasAndroidStudioProjectsBakalaurinis40appbuildintermediatestransformsdexBuilderdebug52.jar, C:UsersLiudasAndroidStudioProjectsBakalaurinis40appbuildintermediatestransformsdexBuilderdebug53.jar, C:UsersLiudasAndroidStudioProjectsBakalaurinis40appbuildintermediatestransformsdexBuilderdebug54.jar, C:UsersLiudasAndroidStudioProjectsBakalaurinis40appbuildintermediatestransformsdexBuilderdebug55.jar, C:UsersLiudasAndroidStudioProjectsBakalaurinis40appbuildintermediatestransformsdexBuilderdebug56.jar, C:UsersLiudasAndroidStudioProjectsBakalaurinis40appbuildintermediatestransformsdexBuilderdebug57.jar, C:UsersLiudasAndroidStudioProjectsBakalaurinis40appbuildintermediatestransformsdexBuilderdebug58.jar, C:UsersLiudasAndroidStudioProjectsBakalaurinis40appbuildintermediatestransformsdexBuilderdebug59.jar, C:UsersLiudasAndroidStudioProjectsBakalaurinis40appbuildintermediatestransformsdexBuilderdebug60.jar, C:UsersLiudasAndroidStudioProjectsBakalaurinis40appbuildintermediatestransformsdexBuilderdebug61.jar, C:UsersLiudasAndroidStudioProjectsBakalaurinis40appbuildintermediatestransformsdexBuilderdebug62.jar, C:UsersLiudasAndroidStudioProjectsBakalaurinis40appbuildintermediatestransformsdexBuilderdebug63.jar, C:UsersLiudasAndroidStudioProjectsBakalaurinis40appbuildintermediatestransformsdexBuilderdebug64.jar, C:UsersLiudasAndroidStudioProjectsBakalaurinis40appbuildintermediatestransformsdexBuilderdebug65.jar, C:UsersLiudasAndroidStudioProjectsBakalaurinis40appbuildintermediatestransformsdexBuilderdebug66.jar, C:UsersLiudasAndroidStudioProjectsBakalaurinis40appbuildintermediatestransformsdexBuilderdebug67.jar, C:UsersLiudasAndroidStudioProjectsBakalaurinis40appbuildintermediatestransformsdexBuilderdebug68.jar, C:UsersLiudasAndroidStudioProjectsBakalaurinis40appbuildintermediatestransformsdexBuilderdebug70.jar
Program type already present: com.google.common.util.concurrent.ListenableFuture
Learn how to resolve the issue at https://developer.android.com/studio/build/dependencies#duplicate_classes.
    at com.android.builder.dexing.D8DexArchiveMerger.getExceptionToRethrow(D8DexArchiveMerger.java:132)
    at com.android.builder.dexing.D8DexArchiveMerger.mergeDexArchives(D8DexArchiveMerger.java:117)
    at com.android.build.gradle.internal.transforms.DexMergerTransformCallable.call(DexMergerTransformCallable.java:101)
    at com.android.build.gradle.internal.transforms.ExternalLibsMergerTransform.transform(ExternalLibsMergerTransform.kt:122)
    at com.android.build.gradle.internal.pipeline.TransformTask$2.call(TransformTask.java:239)
    at com.android.build.gradle.internal.pipeline.TransformTask$2.call(TransformTask.java:235)
    at com.android.builder.profile.ThreadRecorder.record(ThreadRecorder.java:102)
    ... 49 more
Caused by: com.android.tools.r8.CompilationFailedException: Compilation failed to complete
    at com.android.tools.r8.utils.ExceptionUtils.withCompilationHandler(ExceptionUtils.java:65)
    at com.android.tools.r8.utils.ExceptionUtils.withD8CompilationHandler(ExceptionUtils.java:43)
    at com.android.tools.r8.D8.run(D8.java:90)
    at com.android.builder.dexing.D8DexArchiveMerger.mergeDexArchives(D8DexArchiveMerger.java:115)
    ... 54 more
Caused by: com.android.tools.r8.utils.AbortException: Error: Program type already present: com.google.common.util.concurrent.ListenableFuture
    at com.android.tools.r8.utils.Reporter.failIfPendingErrors(Reporter.java:116)
    at com.android.tools.r8.utils.Reporter.fatalError(Reporter.java:74)
    at com.android.tools.r8.utils.ExceptionUtils.withCompilationHandler(ExceptionUtils.java:59)
    ... 57 more

回答1:

Add the following code snippet to your project inside gradle.properties.

android.useAndroidX=true
android.enableJetifier=true

Then Clean and finally Build the project. It should work. If you are still getting errors, copy and paste the logs here.

Edit: Add the following to your build.gradle in app module.

configurations {
    all*.exclude group: 'com.google.guava', module: 'listenablefuture'
}

The error is usually caused by some dependecies that implements Google's guava library.

  • 发表于 2019-02-18 19:06
  • 阅读 ( 2885 )
  • 分类:sof

条评论

请先 登录 后评论
不写代码的码农
小编

篇文章

作家榜 »

  1. 小编 文章
返回顶部
部分文章转自于网络,若有侵权请联系我们删除